میدان زغال‌سنگ
type: Concept
preferred label: coal field @en
related: حوضه تیموک

حوضه تیموک
type: Concept
broader: صربستان
preferred label: Timok Basin @en
related: میدان زغال‌سنگ
scope note: رود و حوضه زغال‌سنگی نزدیک مرزهای بلغارستان و رومانی در شرق صربستان

صربستان
type: Concept
narrower: حوضه تیموک
preferred label: Serbia @en