توده رسوبی بلدون
type: Concept
alternative label: ناحیه کوهستانی بلدون
broader: فرانسه
preferred label: Belledonne Massif @en
scope note: بخشی از ناحیه کوهستانی در جنوب شرق فرانسه.

فرانسه
type: Concept
narrower: توده رسوبی بلدون
preferred label: France @en