تورس فرانسه
type: Concept
broader: فرانسه
preferred label: Tours France @en
scope note: شهری در کناره رود لویر در مرکز ایندره-اِت-لویره، شمال غرب مرکز فرانسه

فرانسه
type: Concept
narrower: تورس فرانسه
preferred label: France @en