حوضه پاریس
type: Concept
broader: فرانسه
preferred label: Paris Basin @en
scope note: فرونشست تدریجی شمال و شمال مرکز فرانسه. توسط کانال انگلیسی در شمال غرب، توده آموریکن در غرب، ماسیف سانترال در جنوب و صفحات لانگرس و لورین در شرق محدود شده است

فرانسه
type: Concept
narrower: حوضه پاریس
preferred label: France @en