روسیلون
type: Concept
broader: فرانسه
preferred label: Roussillon @en
scope note: ناحیه و ایالت قدیمی که تقریباً هم عصر بخش پیرنه-اورینتال (شرقی) مرز اسپانیاست

فرانسه
type: Concept
narrower: روسیلون
preferred label: France @en