نایس فرانسه
type: Concept
broader: فرانسه
preferred label: Nice France @en
scope note: شهری در کناره دریای مدیترانه در ریویرا جنوب آلپ- ماریتیمیز، جنوب شرق فرانسه.

فرانسه
type: Concept
narrower: نایس فرانسه
preferred label: France @en