توده مائورس
type: Concept
broader: وار فرانسه
preferred label: Maures Massif @en
scope note: در ساحل مدیترانه غرب انتهای ریویرادر وار فرانسه

وار فرانسه
type: Concept
narrower: توده مائورس
preferred label: Var France @en