آیرشایر اسکاتلند
type: Concept
broader: ناحیه استراکلاید اسکاتلند
preferred label: Ayrshire Scotland @en
scope note: ایالت قدیمی در ناحیه استراتکلاید، جنوب غرب اسکاتلند

ناحیه استراکلاید اسکاتلند
type: Concept
narrower: آیرشایر اسکاتلند
preferred label: Strathclyde Region Scotland @en