نورفولک انگلستان
type: Concept
broader: آنجلیا شرقی
preferred label: Norfolk England @en

آنجلیا شرقی
type: Concept
broader: انگلستان
narrower: نورفولک انگلستان
preferred label: East Anglia @en
scope note: منطقه ای شامل نواحی نورفولک و سافولک در دریای شمال در منتهاالیه شرقی انگلستان.

انگلستان
type: Concept
narrower: آنجلیا شرقی
preferred label: England @en