موناکو
type: Concept
broader: اروپای غربی
preferred label: Monaco @en
scope note: در دریای مدیترانه نزدیک مرز ایتالیا و فرانسه

اروپای غربی
type: Concept
narrower: موناکو
preferred label: Western Europe @en