وین اتریش
type: Concept
broader: لاور اتریش
preferred label: Vienna Austria @en
scope note: شهر مستقل در کناره رود دانوب در شرق اتریش سفلی؛ شمال شرق اتریش

لاور اتریش
type: Concept
narrower: وین اتریش
preferred label: Lower Austria @en