جنگل باوارین
type: Concept
broader: باواریا آلمان
preferred label: Bavarian Forest @en
scope note: یک ناحیه جنگلی کوهستانی فرعی از جنگل بوهمیان در شرق باواریا

باواریا آلمان
type: Concept
narrower: جنگل باوارین
preferred label: Bavaria Germany @en