بیتر فلد آلمان
type: Concept
broader: آلمان
preferred label: Bitterfeld Germany @en
scope note: شهری در ساکسونی- آنهالت جنوب مرکز آلمان.

آلمان
type: Concept
narrower: بیتر فلد آلمان
preferred label: Germany @en