رودخانه لاهن
type: Concept
broader: آلمان
preferred label: Lahn Rriver @en
related: هسه آلمان
scope note: در جهت جنوب و جنوب غرب جریان یافته در جنوب شرق کوبلنز به رود راین می‌ریزد.

هسه آلمان
type: Concept
preferred label: Hesse Germany @en
related: رودخانه لاهن

آلمان
type: Concept
narrower: رودخانه لاهن
preferred label: Germany @en