آلتنبرگ آلمان
type: Concept
broader: ساکسونی آلمان
preferred label: Altenberg Germany @en
scope note: شهری نزدیک مرز چکسلواکی در ساکسونی، شرق آلمان

ساکسونی آلمان
type: Concept
narrower: آلتنبرگ آلمان
preferred label: Saxony Germany @en