وستروالد
type: Concept
broader: آلمان
preferred label: Westerwald @en
related: هسه آلمان
scope note: ناحیه کوهستانی شمال شرقی که از نزدیک کوبلنز حدود 70 مایل مابین رود راین، رود سایگ ورود لاهن امتداد دارد.

هسه آلمان
type: Concept
preferred label: Hesse Germany @en
related: وستروالد

آلمان
type: Concept
narrower: وستروالد
preferred label: Germany @en