جنگل سیاه
type: Concept
broader: اروپای مرکزی
preferred label: Black Forest @en
related: سوئیس
scope note: ناحیه کوهستانی در غرب بادن- ووتمبرگ که به سمت شمال غرب سوئیس گسترش می یابد.

سوئیس
type: Concept
preferred label: Switzerland @en
related: جنگل سیاه

اروپای مرکزی
type: Concept
narrower: جنگل سیاه
preferred label: Central Europe @en