سوالکی لهستان
type: Concept
broader: لهستان
preferred label: Suwalki Poland @en
scope note: ناحیه و شهری در شرق دریاچه‌های ماسورین در شمال شرق سووالکی، منتهاالیه شمال شرق لسهتان.

لهستان
type: Concept
narrower: سوالکی لهستان
preferred label: Poland @en