لوساتیای زیرین
type: Concept
broader: لهستان
preferred label: Lower Lusatia @en
related: لوساتیا
scope note: آن بخش از لوساتیا که ما بین رودهای نیس و بوبر در جنوب غرب لهستان قرار دارد.

لهستان
type: Concept
narrower: لوساتیای زیرین
preferred label: Poland @en

لوساتیا
type: Concept
preferred label: Lusatia @en
related: لوساتیای زیرین