نوواسول لهستان
type: Concept
broader: لهستان
preferred label: Nowa Sol Poland @en
scope note: شهری در کناره رود اودر در غرب مرکز زیلوناگورا، غرب لهستان.

لهستان
type: Concept
narrower: نوواسول لهستان
preferred label: Poland @en