بوداپست مجارستان
type: Concept
alternative label: ناحیه بوداپست
broader: مجارستان
preferred label: Budapest Hungary @en
scope note: شهری در هر دو سوی رود دانوب در شمال مرکز مجارستان. پایتخت ناحیه پست.

مجارستان
type: Concept
narrower: بوداپست مجارستان
preferred label: Hungary @en