یونان
type: Concept
preferred label: Greece @en
related: رودخانه واردار

رودخانه واردار
type: Concept
broader: اروپا
preferred label: Vardar River @en
related: یونان
scope note: از ماکدونی یوگسلاوی آغاز و به خلیج سالونیکا می ریزد

اروپا
type: Concept
narrower: رودخانه واردار
preferred label: Europe @en