دماغه کورلند
type: Concept
broader: ناحیه بالتیک
preferred label: Courland Spit @en
related: لیتوانی
scope note: دماغه ماسه‌ای باریک در دریای بالتیک در نواحی خودمختار کالینینگراد و لیتوانی

لیتوانی
type: Concept
preferred label: Lithuania @en
related: دماغه کورلند

ناحیه بالتیک
type: Concept
narrower: دماغه کورلند
preferred label: Baltic Region @en