ویلنا لیتوانی
type: Concept
broader: لیتوانی
preferred label: Vilna Lithuania @en
scope note: شهری نزدیک مرز بلاروس در جنوب شرق لیتوانی

لیتوانی
type: Concept
narrower: ویلنا لیتوانی
preferred label: Lithuania @en