ناحیه بالتیک
type: Concept
preferred label: Baltic Region @en
related: ناودیس ماوراء بالتیک

ناودیس ماوراء بالتیک
type: Concept
broader: اروپا
preferred label: Peribaltic Syneclise @en
related: ناحیه بالتیک
scope note: یک ساخت فرونشستی پلاتفرم قاره‌ای در ناحیه دریای بالتیک که توسط یک فروپیچش پوسته ای آرام تشکیل شده است

اروپا
type: Concept
narrower: ناودیس ماوراء بالتیک
preferred label: Europe @en