یو.اس.جی.اس
scope note: برای مدارک منتشر شده توسط سازمان زمین شناسی ایالات متحده استفاده می‌شود.
related: رشته‌کوه راکی ایالات متحده
preferred label: USGS @en
type: Concept

رشته‌کوه راکی ایالات متحده
preferred label: U.S.Rocky Mountains @en
type: Concept
related: یو.اس.جی.اس