یخچال آبی
scope note: کوه اولیمپوس، پارک ملی المپیک در شمال غرب واشنگتن و همچنین در جاهای دیگر
related: رشته‌کوه المپیک
related: واشنگتن
preferred label: Blue Glacier @en
type: Concept

رشته‌کوه المپیک
preferred label: Olympic Mountains @en
type: Concept
related: یخچال آبی

واشنگتن
preferred label: Washington @en
type: Concept
related: یخچال آبی