پیری لند
scope note: ناحیه‌ای در منتهاالیه شمالی گرینلند در اقیانوس منجمد شمالی
broader: گرینلند
preferred label: Peary Land @en
type: Concept

گرینلند
preferred label: Greenland @en
type: Concept
narrower: پیری لند