صفحه یخی گرینلند
scope note: در حوضه‌ای قرار دارد که توسط رشته‌کوه ساحلی احاطه شده‌است و حدوداً 85% جزیره را می‌پوشاند.
broader: گرینلند
preferred label: Greenland Ice Sheet @en
type: Concept

گرینلند
preferred label: Greenland @en
type: Concept
narrower: صفحه یخی گرینلند