معدن وایت‌پین
scope note: معدن مس در رشته‌کوه پورکوپاین نزدیک لیک سوپریور در غرب شبه جزیره علیا میشیگان. ممکن است در محلهای دیگری نیز واقع باشد
related: کان‌سنگ مس
related: معدن
preferred label: White Pine Mine @en
type: Concept

کان‌سنگ مس
preferred label: copper ore @en
type: Concept
related: معدن وایت‌پین

معدن
preferred label: mine @en
type: Concept
related: معدن وایت‌پین