کان‌سنگ اورانیم
preferred label: uranium ore @en
type: Concept
related: معدن رنجر

معدن رنجر
scope note: نهشته کانه‌های اورانیم و معدنی در ناحیه رود الیگاتور، سرزمینهای شمالی
related: کان‌سنگ اورانیم
related: معدن
preferred label: Ranger Mine @en
type: Concept

معدن
preferred label: mine @en
type: Concept
related: معدن رنجر