کرتاسه
preferred label: Cretaceous @en
type: Concept
narrower: سازند وایت ماد

سازند وایت ماد
scope note: خاک رس چینی، سفیدرنگ، نسوز و محصولات سرامیکی از این سازند تامین می شود. جنوب و جنوب غرب ساسکاچوان
related: ساسکاچوان
broader: کرتاسه
preferred label: Whitemud Formation @en
type: Concept

ساسکاچوان
preferred label: Saskatchewan @en
type: Concept
related: سازند وایت ماد