لاپیلی
alternative label: سنگریزه آتشفشانی
scope note: تکه‌ها و قطعات کروی‌شکل گدازه‌ای به اندازه نخود که همراه آتشفشان در سطح تفاله‌های آتشفشانی به بیرون پرتاب می‌شوند.
related: آذرآواری
related: پرتابه
preferred label: lapilli @en
type: Concept

آذرآواری
preferred label: pyroclastic @en
type: Concept
related: لاپیلی

پرتابه
preferred label: ejecta @en
type: Concept
related: لاپیلی