جزایر قناری
preferred label: Canary Islands @en
type: Concept
related: لاپالما

لاپالما
scope note: جزیره‌ای در شمال غرب جزایر قناری. در جاهای دیگر نیز واقع شده است.
related: جزایر قناری
preferred label: La Palma @en
type: Concept