گوهر
preferred label: gem @en
type: Concept
related: گوهرشناسی

گوهرسنگ
preferred label: gemstone @en
type: Concept
related: گوهرشناسی

گوهرشناسی
scope note: علم مطالعۀ گوهرسنگ‌ها که به بررسی منبع و منشأ و توصیف و درجه‏بندی و شناسایی و ارزیابی آنها می‏پردازد
related: گوهرسنگ
related: گوهر
preferred label: gemology @en
type: Concept