گوهر
preferred label: gem @en
type: Concept
related: گوهرسنگ

گوهرسنگ
scope note: نمونه کانی که رنگ و کیفیت درونی عالی داشته باشد و بتوان به دلیل زیبایی و مقاومت کافی از آن برای مصارف زینتی استفاده کرد
related: گوهرشناسی
related: گوهر
preferred label: gemstone @en
type: Concept

گوهرشناسی
preferred label: gemology @en
type: Concept
related: گوهرسنگ