گونه درون سنگی
alternative label: اندولیت
scope note: موجوداتی که در شکافای ریز مرجانها، صدفها و ریفهای سنگی زندگی می کنند.
related: جلبک‌ها
preferred label: endolithic taxon @en
type: Concept

جلبک‌ها
preferred label: Algae @en
type: Concept
related: گونه درون سنگی