نمونه تیپ
preferred label: type specimen @en
type: Concept
related: گونه جدید

گونه جدید
alternative label: نسل جديد
scope note: نمونه انتخاب شده به جای نمونه شاخص، زمانیکه تمامی مواد اولیه از دست رفته یا نابود شده است.
related: فسیل
related: نمونه تیپ
preferred label: neotype @en
type: Concept

فسیل
preferred label: fossil @en
type: Concept
related: گونه جدید