گوشته
preferred label: mantle @en
type: Concept
narrower: گوشته تهی‌نشده

گوشته تهی‌نشده
scope note: مادۀ گوشته‌ای اولیه که هیچ بازالتی از آن خارج نشده است
broader: گوشته
preferred label: undepleted mantle @en
type: Concept