توده آذرین نفوذی
preferred label: pluton @en
type: Concept
related: گنبدسنگ

گنبدسنگ
scope note: برآمدگی بزرگی در سطح فوقانی یک تودۀ نفوذی آذرین که به درون سنگ دیوارۀ بالای آن فرو رفته است
related: توده آذرین نفوذی
related: سنگ آذرین
preferred label: cupola @en
type: Concept

سنگ آذرین
preferred label: igneous rock @en
type: Concept
related: گنبدسنگ