آتشفشان
preferred label: volcano @en
type: Concept
related: گسیل آتشفشانی

آتشفشانی
preferred label: volcanic @en
type: Concept
related: گسیل آتشفشانی

گسیل آتشفشانی
scope note: مواد خروجی عمدتاً گازی که براثر فعالیت آتشفشان از آن خارج می‌شوند
related: آتشفشان
related: آتشفشانی
preferred label: volcanic emission @en
type: Concept