گسل
preferred label: fault @en
type: Concept
narrower: گسل حلقوی

گسل حلقوی
scope note: گسلی مدور که به‌دنبال فرونشست غول‌دهانهیی(cauldron subsidence) یا گنبدهای نمکی (diapris) یا برخورد شهاب‌سنگ‌ها به وجود می‌آید
broader: گسل
preferred label: ring fault @en
type: Concept