چرخش اقیانوسی
preferred label: ocean circulation @en
type: Concept
related: گردش گرماشوری

گردش
preferred label: circulation @en
type: Concept
related: گردش گرماشوری

گردش گرماشوری
scope note: گردش جریانهای آب عمیق که بوسیله دما و شوری آب کنترل می‌شود.
related: چرخش اقیانوسی
related: گردش
preferred label: thermohaline circulation @en
type: Concept