روش لرزه‌ای
preferred label: seismic method @en
type: Concept
related: کوکراست

کوکراست
scope note: مخفف. کنسرسیوم اکتشاف پوسته ای مورد استفاده در روشهای لرزه ای
related: روش لرزه‌ای
related: موج کشسان
preferred label: COCRUST @en
type: Concept

موج کشسان
preferred label: elastic wave @en
type: Concept
related: کوکراست