آتشفشان
preferred label: volcano @en
type: Concept
related: کمان آتشفشانی

کمان آتشفشانی
scope note: رشته‏ای از جزایر آتشفشانی که بر روی نقشه به شکل یک کمان ظاهر می‌شوند
related: آتشفشان
preferred label: volcanic arc @en
type: Concept