کانسار
preferred label: ore deposit @en
type: Concept
narrower: کانسار ماگمایی

کانسار ماگمایی
scope note: کانساری که با جدایش ماگمایی معمولاً در سنگ‌های مافیک و توده‌های نفوذی لایه‌ای تشکیل می‌شود
broader: کانسار
preferred label: magmatic ore deposit @en
type: Concept