تورنتو اونتاریو
scope note: شهری در منتهی‌الیه شمال غربی دریاچه اونتاریو
broader: اونتاریو
preferred label: Toronto Ontario @en
type: Concept

اونتاریو
preferred label: Ontario @en
type: Concept
narrower: تورنتو اونتاریو