دره رود رد دیر
preferred label: Red Deer River Valley @en
type: Concept
related: رودخانه رد دیر

آلبرتا
preferred label: Alberta @en
type: Concept
narrower: رودخانه رد دیر

رودخانه رد دیر
scope note: از پارک ملی بَنف سرچشمه گرفته و به سوی رود ساسکاچوان جنوبی ادامه دارد در نزدیکی مرز ساسکاچوان
related: دره رود رد دیر
broader: آلبرتا
preferred label: Red Deer River @en
type: Concept