آلبرتا
preferred label: Alberta @en
type: Concept
narrower: یخچال آتاباسکا

رشته‌کوه راکی کانادا
preferred label: Canadian Rocky Mountains @en
type: Concept
related: یخچال آتاباسکا

یخچال آتاباسکا
scope note: در کوههای راکی بین پارکهای ملی جاسپروبنف نزدیک مرز بریتیش کلمبیا
related: رشته‌کوه راکی کانادا
broader: آلبرتا
preferred label: Athabasca Glacier @en
type: Concept