ویکتوریا بریتیش کلمبیا
scope note: شهری در کناره جنوبی جزیره ونکوور، جنوب غرب بریتیش کلمبیا
broader: جزیره ونکوور
preferred label: Victoria British Columbia @en
type: Concept

جزیره ونکوور
preferred label: Vancouver Island @en
type: Concept
narrower: ویکتوریا بریتیش کلمبیا